Welcome, Guest

Author Topic: Demo doesn´t work on PIC32 MAXI WEB  (Read 3639 times)

ALFREDOSKY

  • Newbie
  • *
  • Posts: 32
  • Karma: +0/-0
Demo doesn´t work on PIC32 MAXI WEB
« on: June 28, 2014, 01:13:11 AM »
Hi all, my boss bought PIC32 MAXI WEB card, i downloaded the demo code and i tried to run it but doesn´t work, i got a FreeRTOS.X error when i debug MainProgram.X, then i wondering the program previously needs build FreeRTOS, then i open FreeRTOS.X and build it but i got errors, this is i got:

CLEAN SUCCESSFUL (total time: 350ms)
make -f nbproject/Makefile-default.mk SUBPROJECTS= .build-conf
make[1]: Entering directory `C:/Users/D2/Downloads/DemoSoft_PIC32-MAXI-WEB_v1_03/DemoSoft PIC32-MAXI-WEB v1.03/FreeRTOS/FreeRTOS.X'
make  -f nbproject/Makefile-default.mk dist/default/production/FreeRTOS.X.a
make[2]: Entering directory `C:/Users/D2/Downloads/DemoSoft_PIC32-MAXI-WEB_v1_03/DemoSoft PIC32-MAXI-WEB v1.03/FreeRTOS/FreeRTOS.X'
"C:\Program Files (x86)\Microchip\xc32\v1.30\bin\xc32-gcc.exe" -g -x c -c -mprocessor=32MX795F512L -I.. -I../Source/portable/MPLAB/PIC32MX -I../Source/include -MMD -MF build/default/production/_ext/38565645/heap_3.o.d -o build/default/production/_ext/38565645/heap_3.o ../Source/portable/MemMang/heap_3.c
"C:\Program Files (x86)\Microchip\xc32\v1.30\bin\xc32-gcc.exe" -g -x c -c -mprocessor=32MX795F512L -I.. -I../Source/portable/MPLAB/PIC32MX -I../Source/include -MMD -MF build/default/production/_ext/1728301206/list.o.d -o build/default/production/_ext/1728301206/list.o ../Source/list.c
"C:\Program Files (x86)\Microchip\xc32\v1.30\bin\xc32-gcc.exe" -g -x c -c -mprocessor=32MX795F512L -I.. -I../Source/portable/MPLAB/PIC32MX -I../Source/include -MMD -MF build/default/production/_ext/1728301206/queue.o.d -o build/default/production/_ext/1728301206/queue.o ../Source/queue.c
"C:\Program Files (x86)\Microchip\xc32\v1.30\bin\xc32-gcc.exe" -g -x c -c -mprocessor=32MX795F512L -I.. -I../Source/portable/MPLAB/PIC32MX -I../Source/include -MMD -MF build/default/production/_ext/1728301206/tasks.o.d -o build/default/production/_ext/1728301206/tasks.o ../Source/tasks.c
"C:\Program Files (x86)\Microchip\xc32\v1.30\bin\xc32-gcc.exe" -g -x c -c -mprocessor=32MX795F512L -I.. -I../Source/portable/MPLAB/PIC32MX -I../Source/include -MMD -MF build/default/production/_ext/636481312/port.o.d -o build/default/production/_ext/636481312/port.o ../Source/portable/MPLAB/PIC32MX/port.c
C:\Users\D2\AppData\Local\Temp\cc5fOP6R.s: Assembler messages:
C:\Users\D2\AppData\Local\Temp\cc5fOP6R.s: Error: .size expression for xPortStartScheduler does not evaluate to a constant
make[2]: *** [build/default/production/_ext/636481312/port_asm.o] Error 1
"C:\Program Files (x86)\Microchip\xc32\v1.30\bin\xc32-gcc.exe" -c -mprocessor=32MX795F512L -I.. -I.. -I../Source/portable/MPLAB/PIC32MX -I../Source/include -MMD -MF build/default/production/_ext/636481312/port_asm.o.d -o build/default/production/_ext/636481312/port_asm.o ../Source/portable/MPLAB/PIC32MX/port_asm.S -Wa,--defsym=__MPLAB_BUILD=1,-MD=build/default/production/_ext/636481312/port_asm.o.asm.d,--gdwarf-2 -gdwarf-2
make[2]: Leaving directory `C:/Users/D2/Downloads/DemoSoft_PIC32-MAXI-WEB_v1_03/DemoSoft PIC32-MAXI-WEB v1.03/FreeRTOS/FreeRTOS.X'
make[1]: *** [.build-conf] Error 2
make[1]: Leaving directory `C:/Users/D2/Downloads/DemoSoft_PIC32-MAXI-WEB_v1_03/DemoSoft PIC32-MAXI-WEB v1.03/FreeRTOS/FreeRTOS.X'
make: *** [.build-impl] Error 2

BUILD FAILED (exit value 2, total time: 15s)


it suppose the code works, but i dont understand that errors, maybe something missing, please somebody give me guidelines how run properly.  i got icd3 programmer/debugger from microchip  :-\

ALFREDOSKY

  • Newbie
  • *
  • Posts: 32
  • Karma: +0/-0
Re: Demo doesn´t work on PIC32 MAXI WEB
« Reply #1 on: June 30, 2014, 08:22:59 PM »
Nobody from Olimex support?  ???

Stanimir5F

  • Jr. Member
  • **
  • Posts: 80
  • Karma: +2/-0
Re: Demo doesn´t work on PIC32 MAXI WEB
« Reply #2 on: July 01, 2014, 01:56:03 PM »
After your report I checked what's wrong with the project. I found that the problem is in the compiler's version.
When the project was developed XC32 1.21v was used. Now I tried with the latest version of the compiler and I get the same error like you.
Code: [Select]
C:\Users\D2\AppData\Local\Temp\cc5fOP6R.s: Assembler messages:
C:\Users\D2\AppData\Local\Temp\cc5fOP6R.s: Error: .size expression for xPortStartScheduler does not evaluate to a constant
make[2]: *** [build/default/production/_ext/636481312/port_asm.o] Error 1

When I look in the internet I found these threads:
http://www.microchip.com/forums/m764458.aspx
http://www.microchip.com/forums/m755705.aspx

In the second one there is a suggestion how to fix the problem (which is basically using newer version of the Free RTOS version).

The alternative option is to use XC32 1.21v.


The second error that you get is actually the fact that Free RTOS library file is missing due to the problem mentioned above. After all this file (FreeRTOS.X.a) is generated by the project.

Stanimir, Olimex
May the Source be with You!

ALFREDOSKY

  • Newbie
  • *
  • Posts: 32
  • Karma: +0/-0
Re: Demo doesn´t work on PIC32 MAXI WEB
« Reply #3 on: July 11, 2014, 02:14:22 AM »
Thanks for your reply  ;), i will review those post,  ;D

ALFREDOSKY

  • Newbie
  • *
  • Posts: 32
  • Karma: +0/-0
Re: Demo doesn´t work on PIC32 MAXI WEB
« Reply #4 on: August 01, 2014, 08:14:58 PM »
Thank you, you right! the compiler also, reading a lot i solved the problem, i add new line and comment other one in .s file

i comment xPortStartScheduler
Code: [Select]
//.ent xPortStartScheduler
and add this one
Code: [Select]
.ent vPortStartFirstTask
i hope this help others

ALFREDOSKY

  • Newbie
  • *
  • Posts: 32
  • Karma: +0/-0
Re: Demo doesn´t work on PIC32 MAXI WEB
« Reply #5 on: August 20, 2014, 06:27:23 PM »
i used xc32 v1.21 but i got the same error, i don´t understand, please help me!

Code: [Select]
CLEAN SUCCESSFUL (total time: 1s)
make -f nbproject/Makefile-default.mk SUBPROJECTS= .build-conf
make[1]: Entering directory `C:/Users/D2/Downloads/DemoSoft_PIC32-MAXI-WEB_v1_03/DemoSoft PIC32-MAXI-WEB v1.03/TCPIP stack_lib/TCPIP_lib.X'
make  -f nbproject/Makefile-default.mk dist/default/production/TCPIP_lib.X.a
make[2]: Entering directory `C:/Users/D2/Downloads/DemoSoft_PIC32-MAXI-WEB_v1_03/DemoSoft PIC32-MAXI-WEB v1.03/TCPIP stack_lib/TCPIP_lib.X'
"C:\Program Files (x86)\Microchip\xc32\v1.21\bin\xc32-gcc.exe" -g -x c -c -mprocessor=32MX795F512L -I.. -I../../CommonElements -I../../MainProgram -I../../Microchip/Include "-I../../Microchip/Include/TCPIP Stack" -MMD -MF build/default/production/_ext/1614191091/WF_Eint.o.d -o build/default/production/_ext/1614191091/WF_Eint.o "../../Microchip/TCPIP Stack/WiFi/WF_Eint.c"
"C:\Program Files (x86)\Microchip\xc32\v1.21\bin\xc32-gcc.exe" -g -x c -c -mprocessor=32MX795F512L -I.. -I../../CommonElements -I../../MainProgram -I../../Microchip/Include "-I../../Microchip/Include/TCPIP Stack" -MMD -MF build/default/production/_ext/1614191091/WF_pbkdf2.o.d -o build/default/production/_ext/1614191091/WF_pbkdf2.o "../../Microchip/TCPIP Stack/WiFi/WF_pbkdf2.c"
"C:\Program Files (x86)\Microchip\xc32\v1.21\bin\xc32-gcc.exe" -g -x c -c -mprocessor=32MX795F512L -I.. -I../../CommonElements -I../../MainProgram -I../../Microchip/Include "-I../../Microchip/Include/TCPIP Stack" -MMD -MF build/default/production/_ext/1614191091/WF_Spi.o.d -o build/default/production/_ext/1614191091/WF_Spi.o "../../Microchip/TCPIP Stack/WiFi/WF_Spi.c"
"C:\Program Files (x86)\Microchip\xc32\v1.21\bin\xc32-gcc.exe" -g -x c -c -mprocessor=32MX795F512L -I.. -I../../CommonElements -I../../MainProgram -I../../Microchip/Include "-I../../Microchip/Include/TCPIP Stack" -MMD -MF build/default/production/_ext/1614191091/WFConnectionAlgorithm.o.d -o build/default/production/_ext/1614191091/WFConnectionAlgorithm.o "../../Microchip/TCPIP Stack/WiFi/WFConnectionAlgorithm.c"
"C:\Program Files (x86)\Microchip\xc32\v1.21\bin\xc32-gcc.exe" -g -x c -c -mprocessor=32MX795F512L -I.. -I../../CommonElements -I../../MainProgram -I../../Microchip/Include "-I../../Microchip/Include/TCPIP Stack" -MMD -MF build/default/production/_ext/1614191091/WFConnectionManager.o.d -o build/default/production/_ext/1614191091/WFConnectionManager.o "../../Microchip/TCPIP Stack/WiFi/WFConnectionManager.c"
"C:\Program Files (x86)\Microchip\xc32\v1.21\bin\xc32-gcc.exe" -g -x c -c -mprocessor=32MX795F512L -I.. -I../../CommonElements -I../../MainProgram -I../../Microchip/Include "-I../../Microchip/Include/TCPIP Stack" -MMD -MF build/default/production/_ext/1614191091/WFConnectionProfile.o.d -o build/default/production/_ext/1614191091/WFConnectionProfile.o "../../Microchip/TCPIP Stack/WiFi/WFConnectionProfile.c"
"C:\Program Files (x86)\Microchip\xc32\v1.21\bin\xc32-gcc.exe" -g -x c -c -mprocessor=32MX795F512L -I.. -I../../CommonElements -I../../MainProgram -I../../Microchip/Include "-I../../Microchip/Include/TCPIP Stack" -MMD -MF build/default/production/_ext/1614191091/WFConsole.o.d -o build/default/production/_ext/1614191091/WFConsole.o "../../Microchip/TCPIP Stack/WiFi/WFConsole.c"
"C:\Program Files (x86)\Microchip\xc32\v1.21\bin\xc32-gcc.exe" -g -x c -c -mprocessor=32MX795F512L -I.. -I../../CommonElements -I../../MainProgram -I../../Microchip/Include "-I../../Microchip/Include/TCPIP Stack" -MMD -MF build/default/production/_ext/1614191091/WFConsoleIfconfig.o.d -o build/default/production/_ext/1614191091/WFConsoleIfconfig.o "../../Microchip/TCPIP Stack/WiFi/WFConsoleIfconfig.c"
"C:\Program Files (x86)\Microchip\xc32\v1.21\bin\xc32-gcc.exe" -g -x c -c -mprocessor=32MX795F512L -I.. -I../../CommonElements -I../../MainProgram -I../../Microchip/Include "-I../../Microchip/Include/TCPIP Stack" -MMD -MF build/default/production/_ext/1614191091/WFConsoleIwconfig.o.d -o build/default/production/_ext/1614191091/WFConsoleIwconfig.o "../../Microchip/TCPIP Stack/WiFi/WFConsoleIwconfig.c"
"C:\Program Files (x86)\Microchip\xc32\v1.21\bin\xc32-gcc.exe" -g -x c -c -mprocessor=32MX795F512L -I.. -I../../CommonElements -I../../MainProgram -I../../Microchip/Include "-I../../Microchip/Include/TCPIP Stack" -MMD -MF build/default/production/_ext/1614191091/WFConsoleIwpriv.o.d -o build/default/production/_ext/1614191091/WFConsoleIwpriv.o "../../Microchip/TCPIP Stack/WiFi/WFConsoleIwpriv.c"
"C:\Program Files (x86)\Microchip\xc32\v1.21\bin\xc32-gcc.exe" -g -x c -c -mprocessor=32MX795F512L -I.. -I../../CommonElements -I../../MainProgram -I../../Microchip/Include "-I../../Microchip/Include/TCPIP Stack" -MMD -MF build/default/production/_ext/1614191091/WFConsoleMsgHandler.o.d -o build/default/production/_ext/1614191091/WFConsoleMsgHandler.o "../../Microchip/TCPIP Stack/WiFi/WFConsoleMsgHandler.c"
"C:\Program Files (x86)\Microchip\xc32\v1.21\bin\xc32-gcc.exe" -g -x c -c -mprocessor=32MX795F512L -I.. -I../../CommonElements -I../../MainProgram -I../../Microchip/Include "-I../../Microchip/Include/TCPIP Stack" -MMD -MF build/default/production/_ext/1614191091/WFConsoleMsgs.o.d -o build/default/production/_ext/1614191091/WFConsoleMsgs.o "../../Microchip/TCPIP Stack/WiFi/WFConsoleMsgs.c"
"C:\Program Files (x86)\Microchip\xc32\v1.21\bin\xc32-gcc.exe" -g -x c -c -mprocessor=32MX795F512L -I.. -I../../CommonElements -I../../MainProgram -I../../Microchip/Include "-I../../Microchip/Include/TCPIP Stack" -MMD -MF build/default/production/_ext/1614191091/WFDataTxRx.o.d -o build/default/production/_ext/1614191091/WFDataTxRx.o "../../Microchip/TCPIP Stack/WiFi/WFDataTxRx.c"
"C:\Program Files (x86)\Microchip\xc32\v1.21\bin\xc32-gcc.exe" -g -x c -c -mprocessor=32MX795F512L -I.. -I../../CommonElements -I../../MainProgram -I../../Microchip/Include "-I../../Microchip/Include/TCPIP Stack" -MMD -MF build/default/production/_ext/1614191091/WFDebugStrings.o.d -o build/default/production/_ext/1614191091/WFDebugStrings.o "../../Microchip/TCPIP Stack/WiFi/WFDebugStrings.c"
"C:\Program Files (x86)\Microchip\xc32\v1.21\bin\xc32-gcc.exe" -g -x c -c -mprocessor=32MX795F512L -I.. -I../../CommonElements -I../../MainProgram -I../../Microchip/Include "-I../../Microchip/Include/TCPIP Stack" -MMD -MF build/default/production/_ext/1614191091/WFDriverCom.o.d -o build/default/production/_ext/1614191091/WFDriverCom.o "../../Microchip/TCPIP Stack/WiFi/WFDriverCom.c"
"C:\Program Files (x86)\Microchip\xc32\v1.21\bin\xc32-gcc.exe" -g -x c -c -mprocessor=32MX795F512L -I.. -I../../CommonElements -I../../MainProgram -I../../Microchip/Include "-I../../Microchip/Include/TCPIP Stack" -MMD -MF build/default/production/_ext/1614191091/WFDriverCom_24G.o.d -o build/default/production/_ext/1614191091/WFDriverCom_24G.o "../../Microchip/TCPIP Stack/WiFi/WFDriverCom_24G.c"
"C:\Program Files (x86)\Microchip\xc32\v1.21\bin\xc32-gcc.exe" -g -x c -c -mprocessor=32MX795F512L -I.. -I../../CommonElements -I../../MainProgram -I../../Microchip/Include "-I../../Microchip/Include/TCPIP Stack" -MMD -MF build/default/production/_ext/1614191091/WFDriverRaw.o.d -o build/default/production/_ext/1614191091/WFDriverRaw.o "../../Microchip/TCPIP Stack/WiFi/WFDriverRaw.c"
"C:\Program Files (x86)\Microchip\xc32\v1.21\bin\xc32-gcc.exe" -g -x c -c -mprocessor=32MX795F512L -I.. -I../../CommonElements -I../../MainProgram -I../../Microchip/Include "-I../../Microchip/Include/TCPIP Stack" -MMD -MF build/default/production/_ext/1614191091/WFDriverRaw_24G.o.d -o build/default/production/_ext/1614191091/WFDriverRaw_24G.o "../../Microchip/TCPIP Stack/WiFi/WFDriverRaw_24G.c"
"C:\Program Files (x86)\Microchip\xc32\v1.21\bin\xc32-gcc.exe" -g -x c -c -mprocessor=32MX795F512L -I.. -I../../CommonElements -I../../MainProgram -I../../Microchip/Include "-I../../Microchip/Include/TCPIP Stack" -MMD -MF build/default/production/_ext/1614191091/WFEasyConfig.o.d -o build/default/production/_ext/1614191091/WFEasyConfig.o "../../Microchip/TCPIP Stack/WiFi/WFEasyConfig.c"
"C:\Program Files (x86)\Microchip\xc32\v1.21\bin\xc32-gcc.exe" -g -x c -c -mprocessor=32MX795F512L -I.. -I../../CommonElements -I../../MainProgram -I../../Microchip/Include "-I../../Microchip/Include/TCPIP Stack" -MMD -MF build/default/production/_ext/1614191091/WFEventHandler.o.d -o build/default/production/_ext/1614191091/WFEventHandler.o "../../Microchip/TCPIP Stack/WiFi/WFEventHandler.c"
"C:\Program Files (x86)\Microchip\xc32\v1.21\bin\xc32-gcc.exe" -g -x c -c -mprocessor=32MX795F512L -I.. -I../../CommonElements -I../../MainProgram -I../../Microchip/Include "-I../../Microchip/Include/TCPIP Stack" -MMD -MF build/default/production/_ext/1614191091/WFInit.o.d -o build/default/production/_ext/1614191091/WFInit.o "../../Microchip/TCPIP Stack/WiFi/WFInit.c"
"C:\Program Files (x86)\Microchip\xc32\v1.21\bin\xc32-gcc.exe" -g -x c -c -mprocessor=32MX795F512L -I.. -I../../CommonElements -I../../MainProgram -I../../Microchip/Include "-I../../Microchip/Include/TCPIP Stack" -MMD -MF build/default/production/_ext/1614191091/WFMac.o.d -o build/default/production/_ext/1614191091/WFMac.o "../../Microchip/TCPIP Stack/WiFi/WFMac.c"
"C:\Program Files (x86)\Microchip\xc32\v1.21\bin\xc32-gcc.exe" -g -x c -c -mprocessor=32MX795F512L -I.. -I../../CommonElements -I../../MainProgram -I../../Microchip/Include "-I../../Microchip/Include/TCPIP Stack" -MMD -MF build/default/production/_ext/1614191091/WFMac_24G.o.d -o build/default/production/_ext/1614191091/WFMac_24G.o "../../Microchip/TCPIP Stack/WiFi/WFMac_24G.c"
"C:\Program Files (x86)\Microchip\xc32\v1.21\bin\xc32-gcc.exe" -g -x c -c -mprocessor=32MX795F512L -I.. -I../../CommonElements -I../../MainProgram -I../../Microchip/Include "-I../../Microchip/Include/TCPIP Stack" -MMD -MF build/default/production/_ext/1614191091/WFMgmtMsg.o.d -o build/default/production/_ext/1614191091/WFMgmtMsg.o "../../Microchip/TCPIP Stack/WiFi/WFMgmtMsg.c"
"C:\Program Files (x86)\Microchip\xc32\v1.21\bin\xc32-gcc.exe" -g -x c -c -mprocessor=32MX795F512L -I.. -I../../CommonElements -I../../MainProgram -I../../Microchip/Include "-I../../Microchip/Include/TCPIP Stack" -MMD -MF build/default/production/_ext/1614191091/WFMgmtMsg_24G.o.d -o build/default/production/_ext/1614191091/WFMgmtMsg_24G.o "../../Microchip/TCPIP Stack/WiFi/WFMgmtMsg_24G.c"
"C:\Program Files (x86)\Microchip\xc32\v1.21\bin\xc32-gcc.exe" -g -x c -c -mprocessor=32MX795F512L -I.. -I../../CommonElements -I../../MainProgram -I../../Microchip/Include "-I../../Microchip/Include/TCPIP Stack" -MMD -MF build/default/production/_ext/1614191091/WFMgmtMsgTest.o.d -o build/default/production/_ext/1614191091/WFMgmtMsgTest.o "../../Microchip/TCPIP Stack/WiFi/WFMgmtMsgTest.c"
"C:\Program Files (x86)\Microchip\xc32\v1.21\bin\xc32-gcc.exe" -g -x c -c -mprocessor=32MX795F512L -I.. -I../../CommonElements -I../../MainProgram -I../../Microchip/Include "-I../../Microchip/Include/TCPIP Stack" -MMD -MF build/default/production/_ext/1614191091/WFParamMsg.o.d -o build/default/production/_ext/1614191091/WFParamMsg.o "../../Microchip/TCPIP Stack/WiFi/WFParamMsg.c"
"C:\Program Files (x86)\Microchip\xc32\v1.21\bin\xc32-gcc.exe" -g -x c -c -mprocessor=32MX795F512L -I.. -I../../CommonElements -I../../MainProgram -I../../Microchip/Include "-I../../Microchip/Include/TCPIP Stack" -MMD -MF build/default/production/_ext/1614191091/WFParamMsg_24G.o.d -o build/default/production/_ext/1614191091/WFParamMsg_24G.o "../../Microchip/TCPIP Stack/WiFi/WFParamMsg_24G.c"
"C:\Program Files (x86)\Microchip\xc32\v1.21\bin\xc32-gcc.exe" -g -x c -c -mprocessor=32MX795F512L -I.. -I../../CommonElements -I../../MainProgram -I../../Microchip/Include "-I../../Microchip/Include/TCPIP Stack" -MMD -MF build/default/production/_ext/1614191091/WFPowerSave.o.d -o build/default/production/_ext/1614191091/WFPowerSave.o "../../Microchip/TCPIP Stack/WiFi/WFPowerSave.c"
"C:\Program Files (x86)\Microchip\xc32\v1.21\bin\xc32-gcc.exe" -g -x c -c -mprocessor=32MX795F512L -I.. -I../../CommonElements -I../../MainProgram -I../../Microchip/Include "-I../../Microchip/Include/TCPIP Stack" -MMD -MF build/default/production/_ext/1614191091/WFScan.o.d -o build/default/production/_ext/1614191091/WFScan.o "../../Microchip/TCPIP Stack/WiFi/WFScan.c"
"C:\Program Files (x86)\Microchip\xc32\v1.21\bin\xc32-gcc.exe" -g -x c -c -mprocessor=32MX795F512L -I.. -I../../CommonElements -I../../MainProgram -I../../Microchip/Include "-I../../Microchip/Include/TCPIP Stack" -MMD -MF build/default/production/_ext/1614191091/WFTxPower.o.d -o build/default/production/_ext/1614191091/WFTxPower.o "../../Microchip/TCPIP Stack/WiFi/WFTxPower.c"
"C:\Program Files (x86)\Microchip\xc32\v1.21\bin\xc32-gcc.exe" -g -x c -c -mprocessor=32MX795F512L -I.. -I../../CommonElements -I../../MainProgram -I../../Microchip/Include "-I../../Microchip/Include/TCPIP Stack" -MMD -MF build/default/production/_ext/1295770447/UDPPerformanceTest.o.d -o build/default/production/_ext/1295770447/UDPPerformanceTest.o "../../Microchip/TCPIP Stack/UDPPerformanceTest.c"
"C:\Program Files (x86)\Microchip\xc32\v1.21\bin\xc32-gcc.exe" -g -x c -c -mprocessor=32MX795F512L -I.. -I../../CommonElements -I../../MainProgram -I../../Microchip/Include "-I../../Microchip/Include/TCPIP Stack" -MMD -MF build/default/production/_ext/1295770447/Announce.o.d -o build/default/production/_ext/1295770447/Announce.o "../../Microchip/TCPIP Stack/Announce.c"
"C:\Program Files (x86)\Microchip\xc32\v1.21\bin\xc32-gcc.exe" -g -x c -c -mprocessor=32MX795F512L -I.. -I../../CommonElements -I../../MainProgram -I../../Microchip/Include "-I../../Microchip/Include/TCPIP Stack" -MMD -MF build/default/production/_ext/1295770447/ARCFOUR.o.d -o build/default/production/_ext/1295770447/ARCFOUR.o "../../Microchip/TCPIP Stack/ARCFOUR.c"
"C:\Program Files (x86)\Microchip\xc32\v1.21\bin\xc32-gcc.exe" -g -x c -c -mprocessor=32MX795F512L -I.. -I../../CommonElements -I../../MainProgram -I../../Microchip/Include "-I../../Microchip/Include/TCPIP Stack" -MMD -MF build/default/production/_ext/1295770447/ARP.o.d -o build/default/production/_ext/1295770447/ARP.o "../../Microchip/TCPIP Stack/ARP.c"
"C:\Program Files (x86)\Microchip\xc32\v1.21\bin\xc32-gcc.exe" -g -x c -c -mprocessor=32MX795F512L -I.. -I../../CommonElements -I../../MainProgram -I../../Microchip/Include "-I../../Microchip/Include/TCPIP Stack" -MMD -MF build/default/production/_ext/1295770447/AutoIP.o.d -o build/default/production/_ext/1295770447/AutoIP.o "../../Microchip/TCPIP Stack/AutoIP.c"
"C:\Program Files (x86)\Microchip\xc32\v1.21\bin\xc32-gcc.exe" -g -x c -c -mprocessor=32MX795F512L -I.. -I../../CommonElements -I../../MainProgram -I../../Microchip/Include "-I../../Microchip/Include/TCPIP Stack" -MMD -MF build/default/production/_ext/1295770447/BerkeleyAPI.o.d -o build/default/production/_ext/1295770447/BerkeleyAPI.o "../../Microchip/TCPIP Stack/BerkeleyAPI.c"
"C:\Program Files (x86)\Microchip\xc32\v1.21\bin\xc32-gcc.exe" -g -x c -c -mprocessor=32MX795F512L -I.. -I../../CommonElements -I../../MainProgram -I../../Microchip/Include "-I../../Microchip/Include/TCPIP Stack" -MMD -MF build/default/production/_ext/1295770447/BigInt.o.d -o build/default/production/_ext/1295770447/BigInt.o "../../Microchip/TCPIP Stack/BigInt.c"
"C:\Program Files (x86)\Microchip\xc32\v1.21\bin\xc32-gcc.exe" -c -mprocessor=32MX795F512L -I.. -I.. -I../../CommonElements -I../../MainProgram -I../../Microchip/Include "-I../../Microchip/Include/TCPIP Stack" -MMD -MF build/default/production/_ext/1295770447/BigInt_helper_C32.o.d -o build/default/production/_ext/1295770447/BigInt_helper_C32.o "../../Microchip/TCPIP Stack/BigInt_helper_C32.S" -Wa,--defsym=__MPLAB_BUILD=1,-MD=build/default/production/_ext/1295770447/BigInt_helper_C32.o.asm.d,--gdwarf-2 -gdwarf-2
../TCPIPConfig.h: Assembler messages:
make[2]: Leaving directory `C:/Users/D2/Downloads/DemoSoft_PIC32-MAXI-WEB_v1_03/DemoSoft PIC32-MAXI-WEB v1.03/TCPIP stack_lib/TCPIP_lib.X'
make[1]: Leaving directory `C:/Users/D2/Downloads/DemoSoft_PIC32-MAXI-WEB_v1_03/DemoSoft PIC32-MAXI-WEB v1.03/TCPIP stack_lib/TCPIP_lib.X'
../TCPIPConfig.h:480: Error: unrecognized opcode `rom struct{'
../TCPIPConfig.h:481: Error: unrecognized opcode `byte vSocketPurpose'
../TCPIPConfig.h:482: Error: unrecognized opcode `byte vMemoryMedium'
../TCPIPConfig.h:483: Error: unrecognized opcode `word wTXBufferSize'
../TCPIPConfig.h:484: Error: unrecognized opcode `word wRXBufferSize'
../TCPIPConfig.h:485: Error: junk at end of line, first unrecognized character is `}'
../TCPIPConfig.h:486: Error: junk at end of line, first unrecognized character is `{'
../TCPIPConfig.h:492: Error: junk at end of line, first unrecognized character is `{'
../TCPIPConfig.h:493: Error: junk at end of line, first unrecognized character is `{'
../TCPIPConfig.h:508: Error: junk at end of line, first unrecognized character is `{'
../TCPIPConfig.h:509: Error: junk at end of line, first unrecognized character is `{'
../TCPIPConfig.h:510: Error: junk at end of line, first unrecognized character is `{'
../TCPIPConfig.h:511: Error: junk at end of line, first unrecognized character is `{'
../TCPIPConfig.h:514: Error: junk at end of line, first unrecognized character is `}'
make[2]: *** [build/default/production/_ext/1295770447/BigInt_helper_C32.o] Error 1
make[1]: *** [.build-conf] Error 2
make: *** [.build-impl] Error 2

BUILD FAILED (exit value 2, total time: 24s)